Information card for entry 7224215
Chemical name | Nitro-(N,N,N',N'-tetrabutyldiethylenetriamine)palladium(II)tetraphenylborate, tetrahydrofuran solvate |
Formula | C48 H73 B N4 O3 Pd |
Calculated formula | C48 H73 B N4 O3 Pd |
Title of publication | Raising the (metastable) bar: 100% photo-switching in [Pd(Bu4dien)(η1-N̲O2)]+approaches ambient temperature |
Authors of publication | Hatcher, Lauren E. |
Journal of publication | CrystEngComm |
Year of publication | 2016 |
Journal volume | 18 |
Journal issue | 22 |
Pages of publication | 4180 |
a | 11.4898 ± 0.0007 Å |
b | 13.3882 ± 0.0005 Å |
c | 29.98 ± 0.0013 Å |
α | 90° |
β | 94.753 ± 0.005° |
γ | 90° |
Cell volume | 4595.9 ± 0.4 Å3 |
Cell temperature | 100 ± 2 K |
Ambient diffraction temperature | 100 ± 2 K |
Number of distinct elements | 6 |
Space group number | 14 |
Hermann-Mauguin space group symbol | P 1 21/n 1 |
Hall space group symbol | -P 2yn |
Residual factor for all reflections | 0.1051 |
Residual factor for significantly intense reflections | 0.0534 |
Weighted residual factors for significantly intense reflections | 0.0953 |
Weighted residual factors for all reflections included in the refinement | 0.1134 |
Goodness-of-fit parameter for all reflections included in the refinement | 1.001 |
Diffraction radiation wavelength | 0.71073 Å |
Diffraction radiation type | MoKα |