Information card for entry 7224283
Formula | C31 H29 Cd N5 O6 |
Calculated formula | C31 H29 Cd N5 O6 |
Title of publication | Structural variation of transition metal coordination polymers based on bent carboxylate and flexible spacer ligand: polymorphism, gas adsorption and SC-SC transmetallation |
Authors of publication | Pal, Arun; Chand, Santanu; Senthilkumar, S.; Neogi, Subhadip; Das, Madhab C. |
Journal of publication | CrystEngComm |
Year of publication | 2016 |
Journal volume | 18 |
Journal issue | 23 |
Pages of publication | 4323 |
a | 14.261 ± 0.005 Å |
b | 13.024 ± 0.005 Å |
c | 17.038 ± 0.005 Å |
α | 90° |
β | 108.197 ± 0.005° |
γ | 90° |
Cell volume | 3006.3 ± 1.8 Å3 |
Cell temperature | 100 ± 1 K |
Ambient diffraction temperature | 100 ± 1 K |
Number of distinct elements | 5 |
Space group number | 14 |
Hermann-Mauguin space group symbol | P 1 21/c 1 |
Hall space group symbol | -P 2ybc |
Residual factor for all reflections | 0.0508 |
Residual factor for significantly intense reflections | 0.0357 |
Weighted residual factors for significantly intense reflections | 0.0847 |
Weighted residual factors for all reflections included in the refinement | 0.0929 |
Goodness-of-fit parameter for all reflections included in the refinement | 1.036 |
Diffraction radiation wavelength | 0.71069 Å |
Diffraction radiation type | MoKα |