Information card for entry 7224345
Formula | C18 H17 Eu F3 N3 O10 |
Calculated formula | C18 H17 Eu F3 N3 O10 |
Title of publication | Self-assembly synthesis, structural features, reversible temperature-induced dehydration/hydration, and magnetic and luminescence properties of lanthanide(iii) compounds derived from 5-fluoronicotinic acid |
Authors of publication | Cui, Yan-Hui; Liang, Xiao-Xiao; Gu, Jin-Zhong; Wu, Jiang; Kirillov, Alexander M. |
Journal of publication | CrystEngComm |
Year of publication | 2016 |
Journal volume | 18 |
Journal issue | 13 |
Pages of publication | 2303 |
a | 6.7955 ± 0.0004 Å |
b | 12.8007 ± 0.0008 Å |
c | 13.6033 ± 0.0009 Å |
α | 74.644 ± 0.005° |
β | 77.629 ± 0.005° |
γ | 76.699 ± 0.005° |
Cell volume | 1095.54 ± 0.12 Å3 |
Cell temperature | 293 ± 2 K |
Ambient diffraction temperature | 293 ± 2 K |
Number of distinct elements | 6 |
Space group number | 2 |
Hermann-Mauguin space group symbol | P -1 |
Hall space group symbol | -P 1 |
Residual factor for all reflections | 0.0369 |
Residual factor for significantly intense reflections | 0.0311 |
Weighted residual factors for significantly intense reflections | 0.0584 |
Weighted residual factors for all reflections included in the refinement | 0.063 |
Goodness-of-fit parameter for all reflections included in the refinement | 1.038 |
Diffraction radiation wavelength | 0.71073 Å |
Diffraction radiation type | MoKα |