Information card for entry 7224369
Formula | C21 H19 Cu2 Gd I2 N4 O7 |
Calculated formula | C21 H14 Cu2 Gd I2 N4 O7 |
Title of publication | Synthesis, structures and luminescence properties of 3d‒4f heterometallic‒organic frameworks (HMOFs) constructed from different copper halide clusters |
Authors of publication | Zeng, Guang; Xing, Shanghua; Wang, Xiuru; Yang, Yulin; Xiao, Yang; Li, Zhenhua; Li, Guanghua; Shi, Zhan; Feng, Shouhua |
Journal of publication | CrystEngComm |
Year of publication | 2016 |
Journal volume | 18 |
Journal issue | 23 |
Pages of publication | 4336 |
a | 25.493 ± 0.004 Å |
b | 25.493 ± 0.004 Å |
c | 9.1268 ± 0.0018 Å |
α | 90° |
β | 90° |
γ | 90° |
Cell volume | 5931.4 ± 1.8 Å3 |
Cell temperature | 293 ± 2 K |
Ambient diffraction temperature | 293 ± 2 K |
Number of distinct elements | 7 |
Space group number | 122 |
Hermann-Mauguin space group symbol | I -4 2 d |
Hall space group symbol | I -4 2bw |
Residual factor for all reflections | 0.0326 |
Residual factor for significantly intense reflections | 0.0317 |
Weighted residual factors for significantly intense reflections | 0.0797 |
Weighted residual factors for all reflections included in the refinement | 0.0803 |
Goodness-of-fit parameter for all reflections included in the refinement | 1.055 |
Diffraction radiation wavelength | 0.71073 Å |
Diffraction radiation type | MoKα |