Information card for entry 7224413
Formula | C37 H29 N3 O3 |
Calculated formula | C37 H29 N3 O3 |
SMILES | c1ccccc1CN1C(=O)[C@@]2(c3ccccc13)[C@H](C(=O)c1ccc(cc1)OC)[C@@H]1C(=C(C2=N)C#N)c2c(CC1)cccc2.c1ccccc1CN1C(=O)[C@]2(c3ccccc13)[C@@H](C(=O)c1ccc(cc1)OC)[C@H]1C(=C(C2=N)C#N)c2c(CC1)cccc2 |
Title of publication | Molecular diversity of cyclization reaction of 3-methyleneoxindoles with 2-(3,4-dihydronaphthalen-1(2H)-ylidene)malononitriles |
Authors of publication | Lu, Yu-Ling; Sun, Jing; Xie, Ya-Jing; Yan, Chao Guo |
Journal of publication | RSC Adv. |
Year of publication | 2016 |
a | 9.4485 ± 0.0009 Å |
b | 12.2794 ± 0.0012 Å |
c | 12.7142 ± 0.0012 Å |
α | 101.186 ± 0.003° |
β | 96.606 ± 0.003° |
γ | 94.608 ± 0.003° |
Cell volume | 1429.5 ± 0.2 Å3 |
Cell temperature | 296 ± 2 K |
Ambient diffraction temperature | 296 ± 2 K |
Number of distinct elements | 4 |
Space group number | 2 |
Hermann-Mauguin space group symbol | P -1 |
Hall space group symbol | -P 1 |
Residual factor for all reflections | 0.1127 |
Residual factor for significantly intense reflections | 0.0609 |
Weighted residual factors for significantly intense reflections | 0.1219 |
Weighted residual factors for all reflections included in the refinement | 0.1428 |
Goodness-of-fit parameter for all reflections included in the refinement | 1.03 |
Diffraction radiation wavelength | 0.71073 Å |
Diffraction radiation type | MoKα |