Information card for entry 7224419
Formula | C34 H30 Cl N3 O2 |
Calculated formula | C34 H30 Cl N3 O2 |
SMILES | CCCCN1C(=O)[C@@]2(c3cc(C)ccc13)[C@H](C(=O)c1ccc(cc1)Cl)[C@@H]1C(=C(C2=N)C#N)c2ccccc2CC1.CCCCN1C(=O)[C@]2(c3cc(C)ccc13)[C@@H](C(=O)c1ccc(cc1)Cl)[C@H]1C(=C(C2=N)C#N)c2ccccc2CC1 |
Title of publication | Molecular diversity of cyclization reaction of 3-methyleneoxindoles with 2-(3,4-dihydronaphthalen-1(2H)-ylidene)malononitriles |
Authors of publication | Lu, Yu-Ling; Sun, Jing; Xie, Ya-Jing; Yan, Chao Guo |
Journal of publication | RSC Adv. |
Year of publication | 2016 |
a | 9.6977 ± 0.0016 Å |
b | 12.259 ± 0.002 Å |
c | 12.29 ± 0.002 Å |
α | 97.229 ± 0.005° |
β | 102.017 ± 0.005° |
γ | 92.943 ± 0.005° |
Cell volume | 1413.2 ± 0.4 Å3 |
Cell temperature | 296 ± 2 K |
Ambient diffraction temperature | 296 ± 2 K |
Number of distinct elements | 5 |
Space group number | 2 |
Hermann-Mauguin space group symbol | P -1 |
Hall space group symbol | -P 1 |
Residual factor for all reflections | 0.1926 |
Residual factor for significantly intense reflections | 0.0775 |
Weighted residual factors for significantly intense reflections | 0.1344 |
Weighted residual factors for all reflections included in the refinement | 0.1743 |
Goodness-of-fit parameter for all reflections included in the refinement | 1.043 |
Diffraction radiation wavelength | 0.71073 Å |
Diffraction radiation type | MoKα |