Information card for entry 7224474
Formula |
C46 H54 O2 |
Calculated formula |
C46 H54 O2 |
SMILES |
c1c2oc3c(c2cc2c1cc(CCCCCCCCCC)cc2)cc1oc2cc4c(cc2c1c3)ccc(c4)CCCCCCCCCC |
Title of publication |
High Performance Oxygen-bridged N-shaped Semiconductors with Stabilized Crystal Phase and Blue Luminescence |
Authors of publication |
Mitsui, Chikahiko; Tanaka, Yuji; Tanaka, Shota; Yamagishi, Masakazu; Nakahara, Katsumasa; Yano, Masafumi; Sato, Hiroyasu; Yamano, Akihito; Matsui, Hiroyuki; Takeya, Jun; Okamoto, Toshihiro |
Journal of publication |
RSC Adv. |
Year of publication |
2016 |
a |
7.395 ± 0.0005 Å |
b |
5.8775 ± 0.0004 Å |
c |
80.76 ± 0.006 Å |
α |
90° |
β |
90° |
γ |
90° |
Cell volume |
3510.2 ± 0.4 Å3 |
Cell temperature |
296 K |
Ambient diffraction temperature |
296 K |
Number of distinct elements |
3 |
Space group number |
61 |
Hermann-Mauguin space group symbol |
P b c a |
Hall space group symbol |
-P 2ac 2ab |
Residual factor for significantly intense reflections |
0.1178 |
Weighted residual factors for all reflections included in the refinement |
0.3051 |
Goodness-of-fit parameter for all reflections included in the refinement |
1.06 |
Diffraction radiation wavelength |
1.54187 Å |
Diffraction radiation type |
CuKα |
Yes |
No |
No |