Information card for entry 7224480
Formula | C25 H23 N5 O7 Zn |
Calculated formula | C25 H23 N5 O7 Zn |
Title of publication | Two- and three-dimensional Zn(ii) coordination polymers constructed from mixed ligand systems: interpenetration, structural transformation and sensing behavior |
Authors of publication | Park, Min Kyung; Lim, Kwang Soo; Park, Ji Hey; Song, Jeong Hwa; Kang, Dong Won; Lee, Woo Ram; Hong, Chang Seop |
Journal of publication | CrystEngComm |
Year of publication | 2016 |
Journal volume | 18 |
Journal issue | 23 |
Pages of publication | 4349 |
a | 10.2372 ± 0.0003 Å |
b | 27.0204 ± 0.0007 Å |
c | 8.738 ± 0.0002 Å |
α | 90° |
β | 95.568 ± 0.001° |
γ | 90° |
Cell volume | 2405.64 ± 0.11 Å3 |
Cell temperature | 296 ± 2 K |
Ambient diffraction temperature | 296 ± 2 K |
Number of distinct elements | 5 |
Space group number | 14 |
Hermann-Mauguin space group symbol | P 1 21/c 1 |
Hall space group symbol | -P 2ybc |
Residual factor for all reflections | 0.069 |
Residual factor for significantly intense reflections | 0.0567 |
Weighted residual factors for significantly intense reflections | 0.1376 |
Weighted residual factors for all reflections included in the refinement | 0.1523 |
Goodness-of-fit parameter for all reflections included in the refinement | 1.15 |
Diffraction radiation wavelength | 0.71073 Å |
Diffraction radiation type | MoKα |