Information card for entry 7224713
Chemical name | Piv-Aib-L-Pro-SAnt-NH-IBu |
Formula | C24 H38 N4 O5 S |
Calculated formula | C24 H38 N4 O5 S |
SMILES | S(=O)(=O)(NCC(C)C)c1c(NC(=O)[C@H]2N(C(=O)C(NC(=O)C(C)(C)C)(C)C)CCC2)cccc1 |
Title of publication | Residue dependent hydrogen bonding preferences in orthanilic acid-based short peptide β-turn motifs |
Authors of publication | Jedhe, Ganesh S.; Vijayadas, Kuruppanthara N.; Kotmale, Amol; Sangtani, Ekta; Shinde, Dinesh R.; Gonnade, Rajesh G.; Rajamohanan, Pattuparambil R.; Sanjayan, G. J. |
Journal of publication | RSC Adv. |
Year of publication | 2016 |
a | 8.6678 ± 0.0013 Å |
b | 16.756 ± 0.003 Å |
c | 18.108 ± 0.003 Å |
α | 90° |
β | 90° |
γ | 90° |
Cell volume | 2630 ± 0.8 Å3 |
Cell temperature | 90 ± 2 K |
Ambient diffraction temperature | 90 ± 2 K |
Number of distinct elements | 5 |
Space group number | 19 |
Hermann-Mauguin space group symbol | P 21 21 21 |
Hall space group symbol | P 2ac 2ab |
Residual factor for all reflections | 0.0945 |
Residual factor for significantly intense reflections | 0.0656 |
Weighted residual factors for significantly intense reflections | 0.1434 |
Weighted residual factors for all reflections included in the refinement | 0.1696 |
Goodness-of-fit parameter for all reflections included in the refinement | 1.041 |
Diffraction radiation wavelength | 0.71073 Å |
Diffraction radiation type | MoKα |