Information card for entry 7224715
Chemical name | Piv-D-Pro-L-Pro-SAnt-NH-IBu |
Formula | C25 H38 N4 O5 S |
Calculated formula | C25 H38 N4 O5 S |
SMILES | S(=O)(=O)(NCC(C)C)c1c(NC(=O)[C@H]2N(C(=O)[C@@H]3N(C(=O)C(C)(C)C)CCC3)CCC2)cccc1 |
Title of publication | Residue dependent hydrogen bonding preferences in orthanilic acid-based short peptide β-turn motifs |
Authors of publication | Jedhe, Ganesh S.; Vijayadas, Kuruppanthara N.; Kotmale, Amol; Sangtani, Ekta; Shinde, Dinesh R.; Gonnade, Rajesh G.; Rajamohanan, Pattuparambil R.; Sanjayan, G. J. |
Journal of publication | RSC Adv. |
Year of publication | 2016 |
a | 10.3453 ± 0.0004 Å |
b | 11.3579 ± 0.0004 Å |
c | 11.0517 ± 0.0004 Å |
α | 90° |
β | 95.026 ± 0.002° |
γ | 90° |
Cell volume | 1293.59 ± 0.08 Å3 |
Cell temperature | 200 ± 2 K |
Ambient diffraction temperature | 200 ± 2 K |
Number of distinct elements | 5 |
Space group number | 4 |
Hermann-Mauguin space group symbol | P 1 21 1 |
Hall space group symbol | P 2yb |
Residual factor for all reflections | 0.0328 |
Residual factor for significantly intense reflections | 0.0306 |
Weighted residual factors for significantly intense reflections | 0.0679 |
Weighted residual factors for all reflections included in the refinement | 0.0689 |
Goodness-of-fit parameter for all reflections included in the refinement | 1.053 |
Diffraction radiation wavelength | 0.71073 Å |
Diffraction radiation type | MoKα |