Information card for entry 7224717
Chemical name | Boc-L-tert-Leu-L-Pro-SAnt-NH-IBu |
Formula | C26 H42 N4 O6 S |
Calculated formula | C26 H42 N4 O6 S |
SMILES | S(=O)(=O)(NCC(C)C)c1c(NC(=O)[C@H]2N(C(=O)[C@@H](NC(=O)OC(C)(C)C)C(C)(C)C)CCC2)cccc1 |
Title of publication | Residue dependent hydrogen bonding preferences in orthanilic acid-based short peptide β-turn motifs |
Authors of publication | Jedhe, Ganesh S.; Vijayadas, Kuruppanthara N.; Kotmale, Amol; Sangtani, Ekta; Shinde, Dinesh R.; Gonnade, Rajesh G.; Rajamohanan, Pattuparambil R.; Sanjayan, G. J. |
Journal of publication | RSC Adv. |
Year of publication | 2016 |
a | 9.9914 ± 0.0002 Å |
b | 21.9595 ± 0.0004 Å |
c | 14.1883 ± 0.0003 Å |
α | 90° |
β | 109.928 ± 0.001° |
γ | 90° |
Cell volume | 2926.6 ± 0.1 Å3 |
Cell temperature | 200 ± 2 K |
Ambient diffraction temperature | 200 ± 2 K |
Number of distinct elements | 5 |
Space group number | 4 |
Hermann-Mauguin space group symbol | P 1 21 1 |
Hall space group symbol | P 2yb |
Residual factor for all reflections | 0.0561 |
Residual factor for significantly intense reflections | 0.0467 |
Weighted residual factors for significantly intense reflections | 0.0759 |
Weighted residual factors for all reflections included in the refinement | 0.0796 |
Goodness-of-fit parameter for all reflections included in the refinement | 1.07 |
Diffraction radiation wavelength | 0.71073 Å |
Diffraction radiation type | MoKα |