Information card for entry 7224851
Formula | C30 H44 N12 Na2 O34 Zn5 |
Calculated formula | C30 H44 N12 Na2 O34 Zn5 |
Title of publication | Photoelectric properties and potential nitro derivatives sensing by a highly luminescent of Zn (II) and Cd (II) metal-organic frameworks assembled by the flexible hexapodal ligand, 1,3,5-triazine-2,4,6-triamine hexaacetic acid |
Authors of publication | Li, Shuang; Song, Jian; Ni, Jue chen; Wang, Zhi Nan; Gao, Xue; Shi, Zhan; Bai, Fengying; Xing, Yong Heng |
Journal of publication | RSC Adv. |
Year of publication | 2016 |
a | 9.7965 ± 0.0005 Å |
b | 19.2984 ± 0.001 Å |
c | 24.7574 ± 0.0012 Å |
α | 90° |
β | 90° |
γ | 90° |
Cell volume | 4680.6 ± 0.4 Å3 |
Cell temperature | 296 ± 2 K |
Ambient diffraction temperature | 296 ± 2 K |
Number of distinct elements | 6 |
Space group number | 61 |
Hermann-Mauguin space group symbol | P b c a |
Hall space group symbol | -P 2ac 2ab |
Residual factor for all reflections | 0.0975 |
Residual factor for significantly intense reflections | 0.0472 |
Weighted residual factors for significantly intense reflections | 0.0872 |
Weighted residual factors for all reflections included in the refinement | 0.1015 |
Goodness-of-fit parameter for all reflections included in the refinement | 1.009 |
Diffraction radiation wavelength | 0.71073 Å |
Diffraction radiation type | MoKα |