Information card for entry 7224858
Formula | C50 H70 N6 Zn2 |
Calculated formula | C50 H70 N6 Zn2 |
SMILES | c1(c(cccc1C(C)C)C(C)C)[N]1=C(C=C(N2Cc3[n](cccc3)[Zn]3([N](c4c(C(C)C)cccc4C(C)C)=C(C)C=C(N3Cc3[n](cccc3)[Zn]12CC)C)CC)C)C |
Title of publication | Steric and Chelating Ring Concerns on the L-Lactide Polymerization by Asymmetric β-Diketiminato Zinc Complexes |
Authors of publication | Chuang, Wan-Jung; Chen, Hsing-Yin; Chen, Wei-Ting; Chang, Heng Yi; Chiang, Michael, Y.; Hsu, Sodio C.N.; Chen, Hsuan-Ying |
Journal of publication | RSC Adv. |
Year of publication | 2016 |
a | 9.6519 ± 0.0007 Å |
b | 9.7012 ± 0.0007 Å |
c | 14.3904 ± 0.0011 Å |
α | 76.206 ± 0.003° |
β | 88.607 ± 0.003° |
γ | 63.321 ± 0.003° |
Cell volume | 1163.94 ± 0.15 Å3 |
Cell temperature | 200 ± 2 K |
Ambient diffraction temperature | 200 ± 2 K |
Number of distinct elements | 4 |
Space group number | 2 |
Hermann-Mauguin space group symbol | P -1 |
Hall space group symbol | -P 1 |
Residual factor for all reflections | 0.0339 |
Residual factor for significantly intense reflections | 0.031 |
Weighted residual factors for significantly intense reflections | 0.0824 |
Weighted residual factors for all reflections included in the refinement | 0.0842 |
Goodness-of-fit parameter for all reflections included in the refinement | 1.037 |
Diffraction radiation wavelength | 0.71073 Å |
Diffraction radiation type | MoKα |