Information card for entry 7224933
Common name | bis(acridinium) tetrachlorocadmate (II) |
Chemical name | bis(acridinium) tetrachlorocadmate (II) |
Formula | C26 H20 Cd Cl4 N2 |
Calculated formula | C26 H20 Cd Cl4 N2 |
SMILES | c12ccccc1cc1ccccc1[nH+]2.[Cd](Cl)(Cl)([Cl-])[Cl-].c12ccccc1cc1ccccc1[nH+]2 |
Title of publication | Structures and trends of neutral MXxsolvent4−xtetrahedra and anionic [MX4]2−tetrahalometallates of zinc(ii), cadmium(ii) and mercury(ii) with benzopyridine- and benzopyrazine-type N-donor ligands or cations |
Authors of publication | Slabbert, C.; Rademeyer, M. |
Journal of publication | CrystEngComm |
Year of publication | 2016 |
Journal volume | 18 |
Journal issue | 24 |
Pages of publication | 4555 |
a | 12.8432 ± 0.0016 Å |
b | 10.2106 ± 0.0012 Å |
c | 18.821 ± 0.002 Å |
α | 90° |
β | 92.326 ± 0.005° |
γ | 90° |
Cell volume | 2466.1 ± 0.5 Å3 |
Cell temperature | 293 ± 2 K |
Ambient diffraction temperature | 293 ± 2 K |
Number of distinct elements | 5 |
Space group number | 15 |
Hermann-Mauguin space group symbol | C 1 2/c 1 |
Hall space group symbol | -C 2yc |
Residual factor for all reflections | 0.0781 |
Residual factor for significantly intense reflections | 0.0765 |
Weighted residual factors for significantly intense reflections | 0.2109 |
Weighted residual factors for all reflections included in the refinement | 0.2121 |
Goodness-of-fit parameter for all reflections included in the refinement | 1.212 |
Diffraction radiation wavelength | 0.71073 Å |
Diffraction radiation type | MoKα |