Information card for entry 7225029
Formula | C11 H11 N3 O S |
Calculated formula | C11 H11 N3 O S |
SMILES | s1nc2c(N/C(=C\C(=O)C)C)cccc2n1 |
Title of publication | Novel luminescent β-ketoimine derivative of 2,1,3-benzothiadiazole: synthesis, complexation with Zn(II) and photophysical properties in comparison with related compounds |
Authors of publication | Sukhikh, Taisiya Sergeevna; Bashirov, Denis Aleksandrovich; Ogienko, Darya; Kuratieva, Natalia; Sherin, Peter Sergeevich; Rakhmanova, Marianna I.; Chulanova, Elena Aleksandrovna; Gritsan, Nina Pavlovna; Konchenko, Sergey Nikolaevich; Zibarev, Andrey Viktorovich |
Journal of publication | RSC Adv. |
Year of publication | 2016 |
a | 14.9956 ± 0.0004 Å |
b | 10.8026 ± 0.0003 Å |
c | 13.3402 ± 0.0003 Å |
α | 90° |
β | 91.279 ± 0.001° |
γ | 90° |
Cell volume | 2160.46 ± 0.1 Å3 |
Cell temperature | 150 ± 2 K |
Ambient diffraction temperature | 150 ± 2 K |
Number of distinct elements | 5 |
Space group number | 14 |
Hermann-Mauguin space group symbol | P 1 21/c 1 |
Hall space group symbol | -P 2ybc |
Residual factor for all reflections | 0.0516 |
Residual factor for significantly intense reflections | 0.037 |
Weighted residual factors for significantly intense reflections | 0.0956 |
Weighted residual factors for all reflections included in the refinement | 0.1009 |
Goodness-of-fit parameter for all reflections included in the refinement | 1.053 |
Diffraction radiation probe | x-ray |
Diffraction radiation wavelength | 0.71073 Å |
Diffraction radiation type | MoKα |