Information card for entry 7225051
Formula | C132 H84 Dy2 N18 O17 |
Calculated formula | C132 H84 Dy2 N18 O17 |
Title of publication | Syntheses, crystal structures and luminescence properties of lanthanide-based coordination polymers constructed from a functionalized terpyridyl carboxylate ligand |
Authors of publication | Xu, Bing; Cheng, Yue; Hu, Huai-Ming; Bai, Chao; Wang, Xiaofang; Yang, Meng-Lin; Xue, Ganglin |
Journal of publication | CrystEngComm |
Year of publication | 2016 |
Journal volume | 18 |
Journal issue | 24 |
Pages of publication | 4613 |
a | 13.6739 ± 0.0008 Å |
b | 14.3581 ± 0.0008 Å |
c | 16.2252 ± 0.0009 Å |
α | 79.064 ± 0.001° |
β | 77.579 ± 0.001° |
γ | 65.711 ± 0.001° |
Cell volume | 2817.2 ± 0.3 Å3 |
Cell temperature | 296 ± 2 K |
Ambient diffraction temperature | 296 ± 2 K |
Number of distinct elements | 5 |
Space group number | 2 |
Hermann-Mauguin space group symbol | P -1 |
Hall space group symbol | -P 1 |
Residual factor for all reflections | 0.0524 |
Residual factor for significantly intense reflections | 0.0417 |
Weighted residual factors for significantly intense reflections | 0.105 |
Weighted residual factors for all reflections included in the refinement | 0.1155 |
Goodness-of-fit parameter for all reflections included in the refinement | 1.037 |
Diffraction radiation wavelength | 0.71073 Å |
Diffraction radiation type | MoKα |