Information card for entry 7225054
Formula | C132 H88 N18 O17 Yb2 |
Calculated formula | C132 H88 N18 O17 Yb2 |
Title of publication | Syntheses, crystal structures and luminescence properties of lanthanide-based coordination polymers constructed from a functionalized terpyridyl carboxylate ligand |
Authors of publication | Xu, Bing; Cheng, Yue; Hu, Huai-Ming; Bai, Chao; Wang, Xiaofang; Yang, Meng-Lin; Xue, Ganglin |
Journal of publication | CrystEngComm |
Year of publication | 2016 |
Journal volume | 18 |
Journal issue | 24 |
Pages of publication | 4613 |
a | 13.6997 ± 0.0017 Å |
b | 14.3367 ± 0.0018 Å |
c | 16.203 ± 0.002 Å |
α | 79.004 ± 0.002° |
β | 77.826 ± 0.002° |
γ | 65.631 ± 0.002° |
Cell volume | 2814.4 ± 0.6 Å3 |
Cell temperature | 296 ± 2 K |
Ambient diffraction temperature | 296 ± 2 K |
Number of distinct elements | 5 |
Space group number | 2 |
Hermann-Mauguin space group symbol | P -1 |
Hall space group symbol | -P 1 |
Residual factor for all reflections | 0.0539 |
Residual factor for significantly intense reflections | 0.0412 |
Weighted residual factors for significantly intense reflections | 0.0893 |
Weighted residual factors for all reflections included in the refinement | 0.0948 |
Goodness-of-fit parameter for all reflections included in the refinement | 0.98 |
Diffraction radiation wavelength | 0.71073 Å |
Diffraction radiation type | MoKα |