Information card for entry 7225061
Formula | C60 H40 Er2 N6 O14 |
Calculated formula | C60 H40 Er2 N6 O14 |
Title of publication | Syntheses, crystal structures and luminescence properties of lanthanide-based coordination polymers constructed from a functionalized terpyridyl carboxylate ligand |
Authors of publication | Xu, Bing; Cheng, Yue; Hu, Huai-Ming; Bai, Chao; Wang, Xiaofang; Yang, Meng-Lin; Xue, Ganglin |
Journal of publication | CrystEngComm |
Year of publication | 2016 |
Journal volume | 18 |
Journal issue | 24 |
Pages of publication | 4613 |
a | 8.5902 ± 0.0005 Å |
b | 11.3902 ± 0.0007 Å |
c | 14.602 ± 0.0009 Å |
α | 69.573 ± 0.001° |
β | 73.741 ± 0.001° |
γ | 82.79 ± 0.001° |
Cell volume | 1284.72 ± 0.13 Å3 |
Cell temperature | 296 ± 2 K |
Ambient diffraction temperature | 296 ± 2 K |
Number of distinct elements | 5 |
Space group number | 2 |
Hermann-Mauguin space group symbol | P -1 |
Hall space group symbol | -P 1 |
Residual factor for all reflections | 0.0267 |
Residual factor for significantly intense reflections | 0.0239 |
Weighted residual factors for significantly intense reflections | 0.0505 |
Weighted residual factors for all reflections included in the refinement | 0.0518 |
Goodness-of-fit parameter for all reflections included in the refinement | 1.029 |
Diffraction radiation wavelength | 0.71073 Å |
Diffraction radiation type | MoKα |