Information card for entry 7225148
Formula | C6 H8 Cd N8 Ni S6 |
Calculated formula | C6 H8 Cd N8 Ni S6 |
Title of publication | Order‒disorder phase transition in the first thiocyanate-bridged double perovskite-type coordination polymer: [NH4]2[NiCd(SCN)6] |
Authors of publication | Xie, Kai-Ping; Xu, Wei-Jian; He, Chun-Ting; Huang, Bo; Du, Zi-Yi; Su, Yu-Jun; Zhang, Wei-Xiong; Chen, Xiao-Ming |
Journal of publication | CrystEngComm |
Year of publication | 2016 |
Journal volume | 18 |
Journal issue | 24 |
Pages of publication | 4495 |
a | 8.7174 ± 0.0019 Å |
b | 8.617 ± 0.002 Å |
c | 12.019 ± 0.003 Å |
α | 90° |
β | 93.283 ± 0.006° |
γ | 90° |
Cell volume | 901.4 ± 0.4 Å3 |
Cell temperature | 90 K |
Ambient diffraction temperature | 90 K |
Number of distinct elements | 6 |
Space group number | 14 |
Hermann-Mauguin space group symbol | P 1 21/n 1 |
Hall space group symbol | -P 2yn |
Residual factor for all reflections | 0.052 |
Residual factor for significantly intense reflections | 0.0457 |
Weighted residual factors for significantly intense reflections | 0.1007 |
Weighted residual factors for all reflections included in the refinement | 0.1037 |
Goodness-of-fit parameter for all reflections included in the refinement | 0.965 |
Diffraction radiation wavelength | 0.71073 Å |
Diffraction radiation type | MoKα |