Information card for entry 7225165
Chemical name | [Zn(5-Br-1,3-BDC)(bimcz)]n |
Formula | C26 H16 Br N5 O4 Zn |
Calculated formula | C26 H16 Br N5 O4 Zn |
Title of publication | Structural diversity of Zn(ii) coordination polymers based on bis-imidazolyl ligands and 5-R-1,3-benzenedicarboxylate and their photocatalytic properties |
Authors of publication | Cheng, Hong-Jian; Tang, Xiao-Yan; Yuan, Rong-Xin; Lang, Jian-Ping |
Journal of publication | CrystEngComm |
Year of publication | 2016 |
Journal volume | 18 |
Journal issue | 25 |
Pages of publication | 4851 |
a | 11.976 ± 0.002 Å |
b | 13.901 ± 0.003 Å |
c | 17.491 ± 0.006 Å |
α | 90° |
β | 119.05 ± 0.02° |
γ | 90° |
Cell volume | 2545.5 ± 1.2 Å3 |
Cell temperature | 293 ± 2 K |
Ambient diffraction temperature | 293 ± 2 K |
Number of distinct elements | 6 |
Space group number | 14 |
Hermann-Mauguin space group symbol | P 1 21/c 1 |
Hall space group symbol | -P 2ybc |
Residual factor for all reflections | 0.2732 |
Residual factor for significantly intense reflections | 0.1205 |
Weighted residual factors for significantly intense reflections | 0.1937 |
Weighted residual factors for all reflections included in the refinement | 0.2538 |
Goodness-of-fit parameter for all reflections included in the refinement | 1.074 |
Diffraction radiation wavelength | 0.71073 Å |
Diffraction radiation type | MoKα |