Information card for entry 7225175
Formula | C11 H17 N5 O3 Sn |
Calculated formula | C11 H17 N5 O3 Sn |
Title of publication | Organostannoxane-supported nucleobase arrays: synthesis and supramolecular structures of polymeric and molecular organotin complexes containing guanine, uracil and 2-aminopurine |
Authors of publication | Kundu, Subrata; Nagapradeep, N.; Mohapatra, Balaram; Biswas, Sourav; Verma, Sandeep; Chandrasekhar, Vadapalli |
Journal of publication | CrystEngComm |
Year of publication | 2016 |
Journal volume | 18 |
Journal issue | 25 |
Pages of publication | 4807 |
a | 12.117 ± 0.005 Å |
b | 9.762 ± 0.005 Å |
c | 12.936 ± 0.005 Å |
α | 90° |
β | 103.504 ± 0.005° |
γ | 90° |
Cell volume | 1487.8 ± 1.1 Å3 |
Cell temperature | 100 ± 2 K |
Ambient diffraction temperature | 100 ± 2 K |
Number of distinct elements | 5 |
Space group number | 14 |
Hermann-Mauguin space group symbol | P 1 21/c 1 |
Hall space group symbol | -P 2ybc |
Residual factor for all reflections | 0.0455 |
Residual factor for significantly intense reflections | 0.0338 |
Weighted residual factors for significantly intense reflections | 0.0782 |
Weighted residual factors for all reflections included in the refinement | 0.0981 |
Goodness-of-fit parameter for all reflections included in the refinement | 1.118 |
Diffraction radiation wavelength | 0.71069 Å |
Diffraction radiation type | MoKα |