Information card for entry 7225184
Chemical name | di[tetra(chrysazinato)-tetra(N,N-dimethylformamide)-tetra-cobalt(II)] di(N,N-dimethylformamide) solvate hemihydrate |
Formula | C143.05 H120.45 Co8 N10.35 O42.85 |
Calculated formula | C142 H118 Co8 N10 O42.5 |
Title of publication | Transition metal coordination complexes of chrysazin |
Authors of publication | Beldon, Patrick J.; Henke, Sebastian; Monserrat, Bartomeu; Tominaka, Satoshi; Stock, Norbert; Cheetham, Anthony K. |
Journal of publication | CrystEngComm |
Year of publication | 2016 |
Journal volume | 18 |
Journal issue | 27 |
Pages of publication | 5121 |
a | 15.6278 ± 0.0016 Å |
b | 15.6996 ± 0.0015 Å |
c | 29.048 ± 0.003 Å |
α | 90.9201 ± 0.001° |
β | 104.139 ± 0.0016° |
γ | 90.234 ± 0.0013° |
Cell volume | 6909.9 ± 1.2 Å3 |
Cell temperature | 100 K |
Ambient diffraction temperature | 100 K |
Number of distinct elements | 5 |
Space group number | 2 |
Hermann-Mauguin space group symbol | P -1 |
Hall space group symbol | -P 1 |
Residual factor for all reflections | 0.0696 |
Residual factor for significantly intense reflections | 0.0627 |
Weighted residual factors for significantly intense reflections | 0.1777 |
Weighted residual factors for all reflections included in the refinement | 0.1829 |
Goodness-of-fit parameter for all reflections included in the refinement | 1.07 |
Diffraction radiation wavelength | 0.71075 Å |
Diffraction radiation type | MoKα |