Information card for entry 7225195
Formula | C11 H12 O4 |
Calculated formula | C11 H12 O4 |
SMILES | OC(=O)/C=C\c1c(OC)cc(OC)cc1 |
Title of publication | Solid-state photochemistry of cis-cinnamic acids: a competition between [2 + 2] addition and cis‒trans isomerization |
Authors of publication | Veerakanellore, Giri Babu; Captain, Burjor; Ramamurthy, V. |
Journal of publication | CrystEngComm |
Year of publication | 2016 |
Journal volume | 18 |
Journal issue | 25 |
Pages of publication | 4708 |
a | 3.9208 ± 0.0002 Å |
b | 11.0581 ± 0.0007 Å |
c | 12.1034 ± 0.0007 Å |
α | 79.857 ± 0.001° |
β | 86.846 ± 0.001° |
γ | 80.343 ± 0.001° |
Cell volume | 509.07 ± 0.05 Å3 |
Cell temperature | 296 ± 2 K |
Ambient diffraction temperature | 296 ± 2 K |
Number of distinct elements | 3 |
Space group number | 2 |
Hermann-Mauguin space group symbol | P -1 |
Hall space group symbol | -P 1 |
Residual factor for all reflections | 0.0435 |
Residual factor for significantly intense reflections | 0.039 |
Weighted residual factors for significantly intense reflections | 0.1037 |
Weighted residual factors for all reflections included in the refinement | 0.1078 |
Goodness-of-fit parameter for all reflections included in the refinement | 1.046 |
Diffraction radiation wavelength | 0.71073 Å |
Diffraction radiation type | MoKα |