Information card for entry 7225199
Formula | C12 H12 O3 |
Calculated formula | C12 H12 O3 |
SMILES | O=C(O)/C=C/c1ccccc1OCC=C |
Title of publication | Solid-state photochemistry of cis-cinnamic acids: a competition between [2 + 2] addition and cis‒trans isomerization |
Authors of publication | Veerakanellore, Giri Babu; Captain, Burjor; Ramamurthy, V. |
Journal of publication | CrystEngComm |
Year of publication | 2016 |
Journal volume | 18 |
Journal issue | 25 |
Pages of publication | 4708 |
a | 7.738 ± 0.0006 Å |
b | 8.1099 ± 0.0006 Å |
c | 10.0048 ± 0.0008 Å |
α | 71.822 ± 0.001° |
β | 84.921 ± 0.001° |
γ | 64.415 ± 0.001° |
Cell volume | 537.24 ± 0.07 Å3 |
Cell temperature | 296 ± 2 K |
Ambient diffraction temperature | 296 ± 2 K |
Number of distinct elements | 3 |
Space group number | 2 |
Hermann-Mauguin space group symbol | P -1 |
Hall space group symbol | -P 1 |
Residual factor for all reflections | 0.0719 |
Residual factor for significantly intense reflections | 0.0617 |
Weighted residual factors for significantly intense reflections | 0.1697 |
Weighted residual factors for all reflections included in the refinement | 0.1813 |
Goodness-of-fit parameter for all reflections included in the refinement | 1.062 |
Diffraction radiation wavelength | 0.71073 Å |
Diffraction radiation type | MoKα |