Information card for entry 7225226
Formula | C16 H21 N O4 |
Calculated formula | C16 H21 N O4 |
SMILES | OC(=O)[C@H]1[C@H](N(C(=O)CC1)C(C)C)c1ccc(OC)cc1.OC(=O)[C@@H]1[C@@H](N(C(=O)CC1)C(C)C)c1ccc(OC)cc1 |
Title of publication | The rare cis-configured trisubstituted lactam products obtained by the Castagnoli-Cushman reaction in N,N-dimethylformamide |
Authors of publication | Dar'in, Dmitry; Bakulina, Olga; Nikolskaya, Sofia; Gluzdikov, Ivan; Krasavin, Mikhail |
Journal of publication | RSC Adv. |
Year of publication | 2016 |
a | 6.4049 ± 0.0002 Å |
b | 21.301 ± 0.0006 Å |
c | 10.8631 ± 0.0003 Å |
α | 90° |
β | 100.374 ± 0.003° |
γ | 90° |
Cell volume | 1457.83 ± 0.07 Å3 |
Cell temperature | 100 ± 2 K |
Ambient diffraction temperature | 100 ± 2 K |
Number of distinct elements | 4 |
Space group number | 14 |
Hermann-Mauguin space group symbol | P 1 21/c 1 |
Hall space group symbol | -P 2ybc |
Residual factor for all reflections | 0.052 |
Residual factor for significantly intense reflections | 0.0464 |
Weighted residual factors for significantly intense reflections | 0.1248 |
Weighted residual factors for all reflections included in the refinement | 0.1302 |
Goodness-of-fit parameter for all reflections included in the refinement | 1.05 |
Diffraction radiation wavelength | 0.7107 Å |
Diffraction radiation type | MoKα |