Information card for entry 7225229
Formula | C17 H23 N O4 |
Calculated formula | C17 H23 N O4 |
SMILES | OC(=O)[C@@H]1[C@@H](N(C(=O)CC1)C(C)(C)C)c1ccc(OC)cc1.OC(=O)[C@H]1[C@H](N(C(=O)CC1)C(C)(C)C)c1ccc(OC)cc1 |
Title of publication | The rare cis-configured trisubstituted lactam products obtained by the Castagnoli-Cushman reaction in N,N-dimethylformamide |
Authors of publication | Dar'in, Dmitry; Bakulina, Olga; Nikolskaya, Sofia; Gluzdikov, Ivan; Krasavin, Mikhail |
Journal of publication | RSC Adv. |
Year of publication | 2016 |
a | 6.5824 ± 0.0009 Å |
b | 21.392 ± 0.002 Å |
c | 11.5002 ± 0.0013 Å |
α | 90° |
β | 105.054 ± 0.012° |
γ | 90° |
Cell volume | 1563.8 ± 0.3 Å3 |
Cell temperature | 100 ± 2 K |
Ambient diffraction temperature | 100 ± 2 K |
Number of distinct elements | 4 |
Space group number | 14 |
Hermann-Mauguin space group symbol | P 1 21/c 1 |
Hall space group symbol | -P 2ybc |
Residual factor for all reflections | 0.0915 |
Residual factor for significantly intense reflections | 0.0767 |
Weighted residual factors for significantly intense reflections | 0.1865 |
Weighted residual factors for all reflections included in the refinement | 0.198 |
Goodness-of-fit parameter for all reflections included in the refinement | 1.102 |
Diffraction radiation wavelength | 0.7107 Å |
Diffraction radiation type | MoKα |