Information card for entry 7225232
Formula | C15 H19 N O4 |
Calculated formula | C15 H19 N O4 |
SMILES | O=C1N([C@H](c2ccc(OC)cc2)[C@H](C1)C(=O)O)C(C)C.O=C1N([C@@H](c2ccc(OC)cc2)[C@@H](C1)C(=O)O)C(C)C |
Title of publication | The rare cis-configured trisubstituted lactam products obtained by the Castagnoli-Cushman reaction in N,N-dimethylformamide |
Authors of publication | Dar'in, Dmitry; Bakulina, Olga; Nikolskaya, Sofia; Gluzdikov, Ivan; Krasavin, Mikhail |
Journal of publication | RSC Adv. |
Year of publication | 2016 |
a | 9.771 ± 0.003 Å |
b | 14.4414 ± 0.0016 Å |
c | 10.4314 ± 0.0007 Å |
α | 90° |
β | 107.145 ± 0.017° |
γ | 90° |
Cell volume | 1406.5 ± 0.5 Å3 |
Cell temperature | 100 ± 0.2 K |
Ambient diffraction temperature | 100 ± 0.2 K |
Number of distinct elements | 4 |
Space group number | 14 |
Hermann-Mauguin space group symbol | P 1 21/c 1 |
Hall space group symbol | -P 2ybc |
Residual factor for all reflections | 0.0447 |
Residual factor for significantly intense reflections | 0.038 |
Weighted residual factors for significantly intense reflections | 0.0943 |
Weighted residual factors for all reflections included in the refinement | 0.0988 |
Goodness-of-fit parameter for all reflections included in the refinement | 1.025 |
Diffraction radiation wavelength | 0.7107 Å |
Diffraction radiation type | MoKα |