Information card for entry 7225262
Formula | C12 H8 Cd N7 O3 |
Calculated formula | C12 H8 Cd N7 O3 |
Title of publication | Anion- and temperature-dependent assembly, crystal structures and luminescence properties of six new Cd(ii) coordination polymers based on 2,3,5,6-tetrakis(2-pyridyl)pyrazine |
Authors of publication | Wan, Jun; Cai, Song-Liang; Zhang, Kai; Li, Chao-Jie; Feng, Ying; Fan, Jun; Zheng, Sheng-Run; Zhang, Wei-Guang |
Journal of publication | CrystEngComm |
Year of publication | 2016 |
Journal volume | 18 |
Journal issue | 27 |
Pages of publication | 5164 |
a | 6.3373 ± 0.0008 Å |
b | 10.7022 ± 0.0014 Å |
c | 11.3187 ± 0.0015 Å |
α | 107.774 ± 0.002° |
β | 95.235 ± 0.002° |
γ | 104.287 ± 0.001° |
Cell volume | 696.78 ± 0.16 Å3 |
Cell temperature | 298 ± 2 K |
Ambient diffraction temperature | 298 ± 2 K |
Number of distinct elements | 5 |
Space group number | 2 |
Hermann-Mauguin space group symbol | P -1 |
Hall space group symbol | -P 1 |
Residual factor for all reflections | 0.0302 |
Residual factor for significantly intense reflections | 0.0264 |
Weighted residual factors for significantly intense reflections | 0.0597 |
Weighted residual factors for all reflections included in the refinement | 0.0617 |
Goodness-of-fit parameter for all reflections included in the refinement | 1.058 |
Diffraction radiation wavelength | 0.71073 Å |
Diffraction radiation type | MoKα |