Information card for entry 7225265
Formula | C25 H20 Cd2 N14 O7 |
Calculated formula | C25 H20 Cd2 N14 O7 |
Title of publication | Anion- and temperature-dependent assembly, crystal structures and luminescence properties of six new Cd(ii) coordination polymers based on 2,3,5,6-tetrakis(2-pyridyl)pyrazine |
Authors of publication | Wan, Jun; Cai, Song-Liang; Zhang, Kai; Li, Chao-Jie; Feng, Ying; Fan, Jun; Zheng, Sheng-Run; Zhang, Wei-Guang |
Journal of publication | CrystEngComm |
Year of publication | 2016 |
Journal volume | 18 |
Journal issue | 27 |
Pages of publication | 5164 |
a | 24.09 ± 0.002 Å |
b | 14.7011 ± 0.0014 Å |
c | 20.418 ± 0.002 Å |
α | 90° |
β | 122.311 ± 0.001° |
γ | 90° |
Cell volume | 6111.4 ± 1 Å3 |
Cell temperature | 298 ± 2 K |
Ambient diffraction temperature | 298 ± 2 K |
Number of distinct elements | 5 |
Space group number | 15 |
Hermann-Mauguin space group symbol | C 1 2/c 1 |
Hall space group symbol | -C 2yc |
Residual factor for all reflections | 0.0546 |
Residual factor for significantly intense reflections | 0.0326 |
Weighted residual factors for significantly intense reflections | 0.069 |
Weighted residual factors for all reflections included in the refinement | 0.0795 |
Goodness-of-fit parameter for all reflections included in the refinement | 1.03 |
Diffraction radiation wavelength | 0.71073 Å |
Diffraction radiation type | MoKα |