Information card for entry 7225369
Formula | C56 H46 Co3 O25 |
Calculated formula | C56 H42 Co3 O25 |
Title of publication | Two novel nickel(ii) and cobalt(ii) metal‒organic frameworks based on a rigid aromatic multicarboxylate ligand: syntheses, structural characterization and magnetic properties |
Authors of publication | Hu, Tuo-Ping; Xue, Zhi-Jia; Zheng, Bao-Hua; Wang, Xiao-Qing; Hao, Xue-Na; Song, You |
Journal of publication | CrystEngComm |
Year of publication | 2016 |
Journal volume | 18 |
Journal issue | 28 |
Pages of publication | 5386 |
a | 13.8441 ± 0.0006 Å |
b | 17.6855 ± 0.0007 Å |
c | 21.1859 ± 0.0008 Å |
α | 90° |
β | 91.435 ± 0.004° |
γ | 90° |
Cell volume | 5185.5 ± 0.4 Å3 |
Cell temperature | 293 ± 2 K |
Ambient diffraction temperature | 293 ± 2 K |
Number of distinct elements | 4 |
Space group number | 15 |
Hermann-Mauguin space group symbol | C 1 2/c 1 |
Hall space group symbol | -C 2yc |
Residual factor for all reflections | 0.1039 |
Residual factor for significantly intense reflections | 0.0566 |
Weighted residual factors for significantly intense reflections | 0.105 |
Weighted residual factors for all reflections included in the refinement | 0.1245 |
Goodness-of-fit parameter for all reflections included in the refinement | 1.017 |
Diffraction radiation wavelength | 0.71 Å |
Diffraction radiation type | MoKα |