Information card for entry 7225378
Chemical name | pentachloroethane |
Formula | C2 H Cl5 |
Calculated formula | C2 H Cl5 |
SMILES | C(C(Cl)Cl)(Cl)(Cl)Cl |
Title of publication | Halogen and hydrogen bonds in compressed pentachloroethane |
Authors of publication | Bujak, Maciej; Podsiadło, Marcin; Katrusiak, Andrzej |
Journal of publication | CrystEngComm |
Year of publication | 2016 |
Journal volume | 18 |
Journal issue | 28 |
Pages of publication | 5393 |
a | 10.325 ± 0.008 Å |
b | 11.063 ± 0.003 Å |
c | 6.087 ± 0.001 Å |
α | 90° |
β | 90° |
γ | 90° |
Cell volume | 695.3 ± 0.6 Å3 |
Cell temperature | 295 ± 2 K |
Ambient diffraction temperature | 295 ± 2 K |
Cell measurement pressure | 360000 kPa |
Ambient diffracton pressure | 360000 kPa |
Number of distinct elements | 3 |
Space group number | 62 |
Hermann-Mauguin space group symbol | P n m a |
Hall space group symbol | -P 2ac 2n |
Residual factor for all reflections | 0.126 |
Residual factor for significantly intense reflections | 0.1066 |
Weighted residual factors for significantly intense reflections | 0.3214 |
Weighted residual factors for all reflections included in the refinement | 0.3494 |
Goodness-of-fit parameter for all reflections included in the refinement | 1.175 |
Diffraction radiation wavelength | 0.71073 Å |
Diffraction radiation type | MoKα |