Information card for entry 7225385
Formula | C30 H34 Cu N4 O8 |
Calculated formula | C30 H34 Cu N4 O8 |
Title of publication | Particle size effects in the kinetic trapping of a structurally-locked form of a flexible MOF |
Authors of publication | Linder-Patton, Oliver M.; Bloch, Witold M.; Coghlan, Campbell J.; Sumida, Kenji; Kitagawa, Susumu; Furukawa, Shuhei; Doonan, Christian J.; Sumby, Christopher J. |
Journal of publication | CrystEngComm |
Year of publication | 2016 |
Journal volume | 18 |
Journal issue | 22 |
Pages of publication | 4172 |
a | 10.2536 ± 0.0002 Å |
b | 19.8774 ± 0.0004 Å |
c | 14.8763 ± 0.0007 Å |
α | 90° |
β | 90° |
γ | 90° |
Cell volume | 3032.01 ± 0.17 Å3 |
Cell temperature | 150 ± 2 K |
Ambient diffraction temperature | 150 ± 2 K |
Number of distinct elements | 5 |
Space group number | 62 |
Hermann-Mauguin space group symbol | P n m a |
Hall space group symbol | -P 2ac 2n |
Residual factor for all reflections | 0.0643 |
Residual factor for significantly intense reflections | 0.0454 |
Weighted residual factors for significantly intense reflections | 0.1215 |
Weighted residual factors for all reflections included in the refinement | 0.132 |
Goodness-of-fit parameter for all reflections included in the refinement | 1.051 |
Diffraction radiation wavelength | 0.7107 Å |
Diffraction radiation type | MoKα |