Information card for entry 7225392
Chemical name | 4,8-bis(4-ethylphenyl)-2,2,6,6-tetraphenyl-1,3,5,7,2,6,4,8-tetraoxadisiladiborocane |
Formula | C40 H38 B2 O4 Si2 |
Calculated formula | C40 H38 B2 O4 Si2 |
Title of publication | Eight Membered Cyclic-Borasiloxanes: Synthesis, Structural, Photophysical, Steric Strain and DFT calculations |
Authors of publication | Mohan, Gopalakrishnan; Thirumoorthy, Krishnan; Bhuvanesh, Nattamai; Nallasamy, Palanisami |
Journal of publication | RSC Adv. |
Year of publication | 2016 |
a | 9.349 ± 0.002 Å |
b | 12.04 ± 0.003 Å |
c | 16.08 ± 0.003 Å |
α | 86.89 ± 0.002° |
β | 82.97 ± 0.002° |
γ | 83.983 ± 0.002° |
Cell volume | 1784.9 ± 0.7 Å3 |
Cell temperature | 110.15 K |
Ambient diffraction temperature | 110.15 K |
Number of distinct elements | 5 |
Space group number | 2 |
Hermann-Mauguin space group symbol | P -1 |
Hall space group symbol | -P 1 |
Residual factor for all reflections | 0.0527 |
Residual factor for significantly intense reflections | 0.0432 |
Weighted residual factors for significantly intense reflections | 0.1106 |
Weighted residual factors for all reflections included in the refinement | 0.1174 |
Goodness-of-fit parameter for all reflections included in the refinement | 1.024 |
Diffraction radiation wavelength | 0.71073 Å |
Diffraction radiation type | MoKα |