Information card for entry 7225409
Formula | C40 H44 Cl3 Dy N24 O20 |
Calculated formula | C40 H44 Cl3 Dy N24 O20 |
Title of publication | Interaction of a symmetrical α,α′,δ,δ′-tetramethyl-cucurbit[6]uril with Ln3+: potential applications for isolation of lanthanides |
Authors of publication | Yang, Bo; Gao, Zhong-Zheng; Lu, Ji-Hong; Zhu, Qian-Jiang; Xue, Sai-Feng; Tao, Zhu; Prior, Timothy J.; Redshaw, Carl; Wei, Gang; Xiao, Xin |
Journal of publication | CrystEngComm |
Year of publication | 2016 |
Journal volume | 18 |
Journal issue | 26 |
Pages of publication | 5028 |
a | 22.4385 ± 0.0018 Å |
b | 12.4556 ± 0.001 Å |
c | 14.7421 ± 0.0013 Å |
α | 90° |
β | 114.782 ± 0.002° |
γ | 90° |
Cell volume | 3740.8 ± 0.5 Å3 |
Cell temperature | 293 ± 2 K |
Ambient diffraction temperature | 293 ± 2 K |
Number of distinct elements | 6 |
Space group number | 12 |
Hermann-Mauguin space group symbol | C 1 2/m 1 |
Hall space group symbol | -C 2y |
Residual factor for all reflections | 0.0426 |
Residual factor for significantly intense reflections | 0.0421 |
Weighted residual factors for significantly intense reflections | 0.1233 |
Weighted residual factors for all reflections included in the refinement | 0.1237 |
Goodness-of-fit parameter for all reflections included in the refinement | 1.141 |
Diffraction radiation wavelength | 0.71073 Å |
Diffraction radiation type | MoKα |