Information card for entry 7225416
Formula | C40 H44 Ce N27 O33 |
Calculated formula | C40 H44 Ce N27 O33 |
Title of publication | Interaction of a symmetrical α,α′,δ,δ′-tetramethyl-cucurbit[6]uril with Ln3+: potential applications for isolation of lanthanides |
Authors of publication | Yang, Bo; Gao, Zhong-Zheng; Lu, Ji-Hong; Zhu, Qian-Jiang; Xue, Sai-Feng; Tao, Zhu; Prior, Timothy J.; Redshaw, Carl; Wei, Gang; Xiao, Xin |
Journal of publication | CrystEngComm |
Year of publication | 2016 |
Journal volume | 18 |
Journal issue | 26 |
Pages of publication | 5028 |
a | 12.322 ± 0.002 Å |
b | 32.346 ± 0.006 Å |
c | 15.145 ± 0.003 Å |
α | 90° |
β | 92.505 ± 0.002° |
γ | 90° |
Cell volume | 6030.5 ± 1.9 Å3 |
Cell temperature | 293 ± 2 K |
Ambient diffraction temperature | 293 ± 2 K |
Number of distinct elements | 5 |
Space group number | 14 |
Hermann-Mauguin space group symbol | P 1 21/n 1 |
Hall space group symbol | -P 2yn |
Residual factor for all reflections | 0.0754 |
Residual factor for significantly intense reflections | 0.0489 |
Weighted residual factors for significantly intense reflections | 0.1241 |
Weighted residual factors for all reflections included in the refinement | 0.1398 |
Goodness-of-fit parameter for all reflections included in the refinement | 1.028 |
Diffraction radiation wavelength | 0.71073 Å |
Diffraction radiation type | MoKα |