Information card for entry 7225422
Formula | C40 H44 Cl0 N24 Nd O22 |
Calculated formula | C40 H44 N24 Nd O22 |
Title of publication | Interaction of a symmetrical α,α′,δ,δ′-tetramethyl-cucurbit[6]uril with Ln3+: potential applications for isolation of lanthanides |
Authors of publication | Yang, Bo; Gao, Zhong-Zheng; Lu, Ji-Hong; Zhu, Qian-Jiang; Xue, Sai-Feng; Tao, Zhu; Prior, Timothy J.; Redshaw, Carl; Wei, Gang; Xiao, Xin |
Journal of publication | CrystEngComm |
Year of publication | 2016 |
Journal volume | 18 |
Journal issue | 26 |
Pages of publication | 5028 |
a | 22.295 ± 0.013 Å |
b | 12.542 ± 0.007 Å |
c | 14.812 ± 0.008 Å |
α | 90° |
β | 116.125 ± 0.006° |
γ | 90° |
Cell volume | 3719 ± 4 Å3 |
Cell temperature | 293 ± 2 K |
Ambient diffraction temperature | 293 ± 2 K |
Number of distinct elements | 6 |
Space group number | 12 |
Hermann-Mauguin space group symbol | C 1 2/m 1 |
Hall space group symbol | -C 2y |
Residual factor for all reflections | 0.0347 |
Residual factor for significantly intense reflections | 0.0335 |
Weighted residual factors for significantly intense reflections | 0.0972 |
Weighted residual factors for all reflections included in the refinement | 0.0982 |
Goodness-of-fit parameter for all reflections included in the refinement | 1.108 |
Diffraction radiation wavelength | 0.71073 Å |
Diffraction radiation type | MoKα |