Information card for entry 7225426
Formula | C40 H44 Cl3 Gd N24 O21 |
Calculated formula | C40 H48 Cl3 Gd N24 O21 |
Title of publication | Interaction of a symmetrical α,α′,δ,δ′-tetramethyl-cucurbit[6]uril with Ln3+: potential applications for isolation of lanthanides |
Authors of publication | Yang, Bo; Gao, Zhong-Zheng; Lu, Ji-Hong; Zhu, Qian-Jiang; Xue, Sai-Feng; Tao, Zhu; Prior, Timothy J.; Redshaw, Carl; Wei, Gang; Xiao, Xin |
Journal of publication | CrystEngComm |
Year of publication | 2016 |
Journal volume | 18 |
Journal issue | 26 |
Pages of publication | 5028 |
a | 22.397 ± 0.003 Å |
b | 12.4587 ± 0.0016 Å |
c | 14.729 ± 0.002 Å |
α | 90° |
β | 115.102 ± 0.004° |
γ | 90° |
Cell volume | 3721.8 ± 0.9 Å3 |
Cell temperature | 293 ± 2 K |
Ambient diffraction temperature | 293 ± 2 K |
Number of distinct elements | 6 |
Space group number | 12 |
Hermann-Mauguin space group symbol | C 1 2/m 1 |
Hall space group symbol | -C 2y |
Residual factor for all reflections | 0.0766 |
Residual factor for significantly intense reflections | 0.0736 |
Weighted residual factors for significantly intense reflections | 0.224 |
Weighted residual factors for all reflections included in the refinement | 0.228 |
Goodness-of-fit parameter for all reflections included in the refinement | 1.117 |
Diffraction radiation wavelength | 0.71073 Å |
Diffraction radiation type | MoKα |