Information card for entry 7225454
Formula | C24 H24 Cl3 Cu3 Dy N3 O9 |
Calculated formula | C24 H24 Cl3 Cu3 Dy N3 O9 |
Title of publication | Copper(i)‒lanthanide(iii) heterometallic metal‒organic frameworks constructed from 3-(3-pyridyl)acrylic acid: syntheses, structures, and properties |
Authors of publication | Dong, Ruo-Ting; Chen, Xin-Li; Cui, Xiao; Chen, Su-Su; Shen, Mo-Yuan; Li, Chu-Wen; Li, Qian-Hong; Hu, Ming-Yuan; Huang, Lan-Fen; Deng, Hong |
Journal of publication | CrystEngComm |
Year of publication | 2016 |
Journal volume | 18 |
Journal issue | 29 |
Pages of publication | 5547 |
a | 9.7527 ± 0.001 Å |
b | 13.1156 ± 0.0014 Å |
c | 13.1419 ± 0.0014 Å |
α | 96.951 ± 0.001° |
β | 107.563 ± 0.001° |
γ | 98.293 ± 0.001° |
Cell volume | 1561.6 ± 0.3 Å3 |
Cell temperature | 296 ± 2 K |
Ambient diffraction temperature | 296.15 K |
Number of distinct elements | 7 |
Space group number | 2 |
Hermann-Mauguin space group symbol | P -1 |
Hall space group symbol | -P 1 |
Residual factor for all reflections | 0.0387 |
Residual factor for significantly intense reflections | 0.0336 |
Weighted residual factors for significantly intense reflections | 0.0804 |
Weighted residual factors for all reflections included in the refinement | 0.0835 |
Goodness-of-fit parameter for all reflections included in the refinement | 1.047 |
Diffraction radiation wavelength | 0.71073 Å |
Diffraction radiation type | MoKα |