Information card for entry 7225457
Formula | C24 H24 Cl3 Cu3 N3 O9 Tb |
Calculated formula | C24 H22 Cl3 Cu3 N3 O9 Tb |
Title of publication | Copper(i)‒lanthanide(iii) heterometallic metal‒organic frameworks constructed from 3-(3-pyridyl)acrylic acid: syntheses, structures, and properties |
Authors of publication | Dong, Ruo-Ting; Chen, Xin-Li; Cui, Xiao; Chen, Su-Su; Shen, Mo-Yuan; Li, Chu-Wen; Li, Qian-Hong; Hu, Ming-Yuan; Huang, Lan-Fen; Deng, Hong |
Journal of publication | CrystEngComm |
Year of publication | 2016 |
Journal volume | 18 |
Journal issue | 29 |
Pages of publication | 5547 |
a | 9.7468 ± 0.0013 Å |
b | 13.1256 ± 0.0017 Å |
c | 13.1381 ± 0.0017 Å |
α | 97.029 ± 0.002° |
β | 98.26 ± 0.002° |
γ | 107.433 ± 0.002° |
Cell volume | 1562.4 ± 0.4 Å3 |
Cell temperature | 296 ± 2 K |
Ambient diffraction temperature | 296.15 K |
Number of distinct elements | 7 |
Space group number | 2 |
Hermann-Mauguin space group symbol | P -1 |
Hall space group symbol | -P 1 |
Residual factor for all reflections | 0.0512 |
Residual factor for significantly intense reflections | 0.0453 |
Weighted residual factors for significantly intense reflections | 0.1154 |
Weighted residual factors for all reflections included in the refinement | 0.12 |
Goodness-of-fit parameter for all reflections included in the refinement | 1.067 |
Diffraction radiation wavelength | 0.71073 Å |
Diffraction radiation type | MoKα |