Information card for entry 7225470
Formula | C17 H16 Br2 Cu2 N2 O8 Tb |
Calculated formula | C17 H14 Br2 Cu2 N2 O8 Tb |
Title of publication | Copper(i)‒lanthanide(iii) heterometallic metal‒organic frameworks constructed from 3-(3-pyridyl)acrylic acid: syntheses, structures, and properties |
Authors of publication | Dong, Ruo-Ting; Chen, Xin-Li; Cui, Xiao; Chen, Su-Su; Shen, Mo-Yuan; Li, Chu-Wen; Li, Qian-Hong; Hu, Ming-Yuan; Huang, Lan-Fen; Deng, Hong |
Journal of publication | CrystEngComm |
Year of publication | 2016 |
Journal volume | 18 |
Journal issue | 29 |
Pages of publication | 5547 |
a | 7.4069 ± 0.0015 Å |
b | 7.7788 ± 0.0015 Å |
c | 21.614 ± 0.004 Å |
α | 86.456 ± 0.003° |
β | 87.677 ± 0.004° |
γ | 65.171 ± 0.003° |
Cell volume | 1127.9 ± 0.4 Å3 |
Cell temperature | 296 ± 2 K |
Ambient diffraction temperature | 296.15 K |
Number of distinct elements | 7 |
Space group number | 2 |
Hermann-Mauguin space group symbol | P -1 |
Hall space group symbol | -P 1 |
Residual factor for all reflections | 0.0939 |
Residual factor for significantly intense reflections | 0.0585 |
Weighted residual factors for significantly intense reflections | 0.12 |
Weighted residual factors for all reflections included in the refinement | 0.1387 |
Goodness-of-fit parameter for all reflections included in the refinement | 0.946 |
Diffraction radiation wavelength | 0.71073 Å |
Diffraction radiation type | MoKα |