Information card for entry 7225476
Common name | 5j |
Chemical name | 3-(4-(4-chlorophenyl)-1H-1,2,3-triazol-1-yl)-6-methoxy-2H-chromen-2-one |
Formula | C18 H12 Cl N3 O3 |
Calculated formula | C18 H12 Cl N3 O3 |
SMILES | c1(=O)c(cc2cc(ccc2o1)OC)n1cc(c2ccc(cc2)Cl)nn1 |
Title of publication | Engineering organic semiconducting solids. Multicomponent access to crystalline 3-(4-aryl-1,2,3-triazolyl)coumarins |
Authors of publication | de la Cerda-Pedro, J. E.; Arcos-Ramos, R.; Maldonado-Domínguez, M.; Rojas-Lima, S.; Romero-Ávila, M.; Carreón-Castro, M. P.; Santillan, R.; Farfán, N.; López-Ruiz, H. |
Journal of publication | CrystEngComm |
Year of publication | 2016 |
Journal volume | 18 |
Journal issue | 29 |
Pages of publication | 5562 |
a | 5.8823 ± 0.0004 Å |
b | 7.5418 ± 0.0004 Å |
c | 18.0542 ± 0.0008 Å |
α | 78.784 ± 0.004° |
β | 83.537 ± 0.004° |
γ | 83.826 ± 0.005° |
Cell volume | 777.63 ± 0.08 Å3 |
Cell temperature | 293 ± 2 K |
Ambient diffraction temperature | 293 ± 2 K |
Number of distinct elements | 5 |
Space group number | 2 |
Hermann-Mauguin space group symbol | P -1 |
Hall space group symbol | -P 1 |
Residual factor for all reflections | 0.048 |
Residual factor for significantly intense reflections | 0.0401 |
Weighted residual factors for significantly intense reflections | 0.1097 |
Weighted residual factors for all reflections included in the refinement | 0.1187 |
Goodness-of-fit parameter for all reflections included in the refinement | 1.0481 |
Diffraction radiation wavelength | 1.54184 Å |
Diffraction radiation type | CuKα |