Information card for entry 7225538
Common name | Tolbutamide form I^L^ |
Chemical name | N-(Butylcarbamoyl)-4-methylbenzenesulfonamide |
Formula | C12 H18 N2 O3 S |
Calculated formula | C12 H18 N2 O3 S |
SMILES | Cc1ccc(cc1)S(=O)(=O)NC(=O)NCCCC |
Title of publication | Single-crystal to single-crystal conformational polymorphic transformation in tolbutamide at 313 K. Relation to other polymorphic transformations in tolbutamide and chlorpropamide |
Authors of publication | Drebushchak, T. N.; Drebushchak, V. A.; Pankrushina, N. A.; Boldyreva, E. V. |
Journal of publication | CrystEngComm |
Year of publication | 2016 |
Journal volume | 18 |
Journal issue | 30 |
Pages of publication | 5736 |
a | 19.4331 ± 0.0003 Å |
b | 7.801 ± 0.0001 Å |
c | 9.0277 ± 0.0001 Å |
α | 90° |
β | 90° |
γ | 90° |
Cell volume | 1368.58 ± 0.03 Å3 |
Cell temperature | 100 ± 2 K |
Ambient diffraction temperature | 100 ± 2 K |
Number of distinct elements | 5 |
Space group number | 33 |
Hermann-Mauguin space group symbol | P n a 21 |
Hall space group symbol | P 2c -2n |
Residual factor for all reflections | 0.0306 |
Residual factor for significantly intense reflections | 0.0277 |
Weighted residual factors for significantly intense reflections | 0.0715 |
Weighted residual factors for all reflections included in the refinement | 0.0724 |
Goodness-of-fit parameter for all reflections included in the refinement | 1.021 |
Diffraction radiation probe | x-ray |
Diffraction radiation wavelength | 0.71073 Å |
Diffraction radiation type | MoKα |