Information card for entry 7225543
Formula | C32 H48 Co N7 O6 |
Calculated formula | C31.3 H44 Co N7 O5.3 |
Title of publication | Control of the photochromic behavior of cobaloxime complexes with salicylidene-3-aminopyridine and 2-cyanoethyl groups by dual photoisomerization |
Authors of publication | Sekine, Akiko; Ina, Sayaka; Johmoto, Kohei; Uekusa, Hidehiro |
Journal of publication | CrystEngComm |
Year of publication | 2016 |
Journal volume | 18 |
Journal issue | 38 |
Pages of publication | 7330 |
a | 9.168 ± 0.0006 Å |
b | 26.964 ± 0.002 Å |
c | 14.024 ± 0.0011 Å |
α | 90° |
β | 97.328 ± 0.002° |
γ | 90° |
Cell volume | 3438.5 ± 0.4 Å3 |
Cell temperature | 173 ± 2 K |
Ambient diffraction temperature | 173 ± 2 K |
Ambient diffracton pressure | 101.3 kPa |
Number of distinct elements | 5 |
Space group number | 14 |
Hermann-Mauguin space group symbol | P 1 21/n 1 |
Hall space group symbol | -P 2yn |
Residual factor for all reflections | 0.153 |
Residual factor for significantly intense reflections | 0.0839 |
Weighted residual factors for significantly intense reflections | 0.16 |
Weighted residual factors for all reflections included in the refinement | 0.1922 |
Goodness-of-fit parameter for all reflections included in the refinement | 1.062 |
Diffraction radiation probe | x-ray |
Diffraction radiation wavelength | 0.71073 Å |
Diffraction radiation type | MoKα |