Information card for entry 7225554
Formula | C109.5 H131 Cl15 N20 Pt4 |
Calculated formula | C109.5 H131 Cl15 N20 Pt4 |
Title of publication | A family of heterotetrameric clusters of chloride species and halomethanes held by two halogen and two hydrogen bonds |
Authors of publication | Ivanov, Daniil M.; Novikov, Alexander S.; Starova, Galina L.; Haukka, Matti; Kukushkin, Vadim Yu. |
Journal of publication | CrystEngComm |
Year of publication | 2016 |
Journal volume | 18 |
Journal issue | 28 |
Pages of publication | 5278 |
a | 10.7179 ± 0.0003 Å |
b | 13.6861 ± 0.0004 Å |
c | 20.5784 ± 0.0007 Å |
α | 84.512 ± 0.003° |
β | 87.526 ± 0.002° |
γ | 85.48 ± 0.002° |
Cell volume | 2993.46 ± 0.16 Å3 |
Cell temperature | 100 ± 2 K |
Ambient diffraction temperature | 100 ± 2 K |
Number of distinct elements | 5 |
Space group number | 2 |
Hermann-Mauguin space group symbol | P -1 |
Hall space group symbol | -P 1 |
Residual factor for all reflections | 0.0648 |
Residual factor for significantly intense reflections | 0.0465 |
Weighted residual factors for significantly intense reflections | 0.0945 |
Weighted residual factors for all reflections included in the refinement | 0.1022 |
Goodness-of-fit parameter for all reflections included in the refinement | 1.109 |
Diffraction radiation wavelength | 0.71073 Å |
Diffraction radiation type | MoKα |