Information card for entry 7225574
Formula | C60 H68 Mn3 N10 O18 |
Calculated formula | C60 H66 Mn3 N10 O18 |
Title of publication | In situ identification and absolute separation of small molecules by single crystal X-ray diffraction in metal‒organic frameworks |
Authors of publication | Gao, Heng Ya; Zhang, Le; Yan, Chang Sheng; Meng, Li Na; Li, Jian Qiang; Meng, Pan Pan; Gong, Le Le; Luo, Feng |
Journal of publication | CrystEngComm |
Year of publication | 2016 |
Journal volume | 18 |
Journal issue | 29 |
Pages of publication | 5429 |
a | 11.3694 ± 0.0007 Å |
b | 12.439 ± 0.0007 Å |
c | 12.4649 ± 0.0008 Å |
α | 102.276 ± 0.003° |
β | 110.249 ± 0.003° |
γ | 92.234 ± 0.003° |
Cell volume | 1603.84 ± 0.17 Å3 |
Cell temperature | 296 ± 2 K |
Ambient diffraction temperature | 296 ± 2 K |
Number of distinct elements | 5 |
Space group number | 2 |
Hermann-Mauguin space group symbol | P -1 |
Hall space group symbol | -P 1 |
Residual factor for all reflections | 0.0674 |
Residual factor for significantly intense reflections | 0.056 |
Weighted residual factors for significantly intense reflections | 0.1288 |
Weighted residual factors for all reflections included in the refinement | 0.1395 |
Goodness-of-fit parameter for all reflections included in the refinement | 1.131 |
Diffraction radiation wavelength | 0.71073 Å |
Diffraction radiation type | MoKα |