Information card for entry 7225604
Chemical name | (34_F2 or 10-019) |
Formula | C13 H9 F2 N O |
Calculated formula | C13 H9 F2 N O |
SMILES | Fc1cc(C(=O)Nc2ccccc2)ccc1F |
Title of publication | Short C‒H⋯F interactions involving the 2,5-difluorobenzene group: understanding the role of fluorine in aggregation and complex C‒F/C‒H disorder in a 2 ×6 isomer grid |
Authors of publication | Mocilac, P.; Osman, I. A.; Gallagher, J. F. |
Journal of publication | CrystEngComm |
Year of publication | 2016 |
Journal volume | 18 |
Journal issue | 30 |
Pages of publication | 5764 |
a | 5.4519 ± 0.0002 Å |
b | 7.7415 ± 0.0005 Å |
c | 12.9335 ± 0.0007 Å |
α | 106.965 ± 0.005° |
β | 100.535 ± 0.004° |
γ | 90.213 ± 0.004° |
Cell volume | 512.37 ± 0.05 Å3 |
Cell temperature | 294 ± 2 K |
Ambient diffraction temperature | 294 ± 1 K |
Number of distinct elements | 5 |
Space group number | 2 |
Hermann-Mauguin space group symbol | P -1 |
Hall space group symbol | -P 1 |
Residual factor for all reflections | 0.0412 |
Residual factor for significantly intense reflections | 0.0333 |
Weighted residual factors for significantly intense reflections | 0.0955 |
Weighted residual factors for all reflections included in the refinement | 0.0983 |
Goodness-of-fit parameter for all reflections included in the refinement | 1.064 |
Diffraction radiation wavelength | 0.71073 Å |
Diffraction radiation type | MoKα |