Information card for entry 7225614
Common name | glycine-DL-tartaric acid (1:1) |
Chemical name | glycine-DL-tartaric acid (1:1) |
Formula | C6 H11 N O8 |
Calculated formula | C6 H11 N O8 |
SMILES | O[C@@H](C(=O)O)[C@@H](O)C(=O)O.O=C([O-])C[NH3+].O[C@H](C(=O)O)[C@H](O)C(=O)O.O=C([O-])C[NH3+] |
Title of publication | Polymorphic transformations in glycine co-crystals at low temperature and high pressure: two new examples as a follow-up to a glycine‒glutaric acid study |
Authors of publication | Losev, E. A.; Zakharov, B. A.; Boldyreva, E. V. |
Journal of publication | CrystEngComm |
Year of publication | 2016 |
Journal volume | 18 |
Journal issue | 31 |
Pages of publication | 5869 |
a | 4.8221 ± 0.0006 Å |
b | 9.3052 ± 0.0009 Å |
c | 20.493 ± 0.003 Å |
α | 90° |
β | 102.666 ± 0.01° |
γ | 90° |
Cell volume | 897.2 ± 0.2 Å3 |
Cell temperature | 175 ± 2 K |
Ambient diffraction temperature | 175 ± 2 K |
Number of distinct elements | 4 |
Space group number | 14 |
Hermann-Mauguin space group symbol | P 1 21/c 1 |
Hall space group symbol | -P 2ybc |
Residual factor for all reflections | 0.0838 |
Residual factor for significantly intense reflections | 0.0362 |
Weighted residual factors for significantly intense reflections | 0.0863 |
Weighted residual factors for all reflections included in the refinement | 0.116 |
Goodness-of-fit parameter for all reflections included in the refinement | 0.972 |
Diffraction radiation wavelength | 0.71073 Å |
Diffraction radiation type | MoKα |