Information card for entry 7225630
Common name | glycine-DL-tartaric acid (1:1) |
Chemical name | glycine-DL-tartaric acid (1:1) |
Formula | C6 H11 N O8 |
Calculated formula | C6 H11 N O8 |
SMILES | C(=O)([C@@H]([C@H](C(=O)O)O)O)O.C(=O)(C[NH3+])[O-].C(=O)([C@H]([C@@H](C(=O)O)O)O)O.C(=O)(C[NH3+])[O-] |
Title of publication | Polymorphic transformations in glycine co-crystals at low temperature and high pressure: two new examples as a follow-up to a glycine‒glutaric acid study |
Authors of publication | Losev, E. A.; Zakharov, B. A.; Boldyreva, E. V. |
Journal of publication | CrystEngComm |
Year of publication | 2016 |
Journal volume | 18 |
Journal issue | 31 |
Pages of publication | 5869 |
a | 4.8193 ± 0.0003 Å |
b | 9.2205 ± 0.0012 Å |
c | 18.9807 ± 0.0013 Å |
α | 99.01 ± 0.008° |
β | 93.373 ± 0.006° |
γ | 96.474 ± 0.008° |
Cell volume | 825.2 ± 0.13 Å3 |
Cell temperature | 293 ± 2 K |
Ambient diffraction temperature | 293 ± 2 K |
Cell measurement pressure | 1010000 kPa |
Ambient diffracton pressure | 1010000 kPa |
Number of distinct elements | 4 |
Space group number | 2 |
Hermann-Mauguin space group symbol | P -1 |
Hall space group symbol | -P 1 |
Residual factor for all reflections | 0.1571 |
Residual factor for significantly intense reflections | 0.0995 |
Weighted residual factors for significantly intense reflections | 0.2501 |
Weighted residual factors for all reflections included in the refinement | 0.3045 |
Goodness-of-fit parameter for all reflections included in the refinement | 1.063 |
Diffraction radiation wavelength | 0.71073 Å |
Diffraction radiation type | MoKα |