Information card for entry 7225667
Formula | C13 H11 Cl2 N O4 |
Calculated formula | C13 H11 Cl2 N O4 |
SMILES | ClC1=C([O-])C(=O)C(=C(O)C1=O)Cl.[nH+]1c(c(ccc1)C)C |
Title of publication | High resolution X-ray and neutron diffraction studies on molecular complexes of chloranilic acid and lutidines |
Authors of publication | Sovago, Ioana; Thomas, Lynne H.; Adam, Martin S.; Capelli, Silvia C.; Wilson, Chick C.; Farrugia, Louis J. |
Journal of publication | CrystEngComm |
Year of publication | 2016 |
Journal volume | 18 |
Journal issue | 30 |
Pages of publication | 5697 |
a | 3.8653 ± 0.0004 Å |
b | 11.5522 ± 0.0012 Å |
c | 14.4711 ± 0.0014 Å |
α | 98.976 ± 0.006° |
β | 93.377 ± 0.005° |
γ | 91.025 ± 0.006° |
Cell volume | 636.91 ± 0.11 Å3 |
Cell temperature | 100 ± 2 K |
Ambient diffraction temperature | 100 ± 2 K |
Number of distinct elements | 5 |
Space group number | 2 |
Hermann-Mauguin space group symbol | P -1 |
Hall space group symbol | -P 1 |
Residual factor for all reflections | 0.0767 |
Residual factor for significantly intense reflections | 0.0457 |
Weighted residual factors for significantly intense reflections | 0.0909 |
Weighted residual factors for all reflections included in the refinement | 0.098 |
Goodness-of-fit parameter for all reflections included in the refinement | 1.019 |
Diffraction radiation probe | x-ray |
Diffraction radiation wavelength | 0.71073 Å |
Diffraction radiation type | MoKα |