Information card for entry 7225683
Formula | C20 H20 Cl2 N2 O4 |
Calculated formula | C20 H20 Cl2 N2 O4 |
SMILES | [O-]C1=C(Cl)C(=O)C([O-])=C(Cl)C1=O.[nH+]1c(C)cccc1C.Cc1cccc(C)[nH+]1 |
Title of publication | High resolution X-ray and neutron diffraction studies on molecular complexes of chloranilic acid and lutidines |
Authors of publication | Sovago, Ioana; Thomas, Lynne H.; Adam, Martin S.; Capelli, Silvia C.; Wilson, Chick C.; Farrugia, Louis J. |
Journal of publication | CrystEngComm |
Year of publication | 2016 |
Journal volume | 18 |
Journal issue | 30 |
Pages of publication | 5697 |
a | 7.1427 ± 0.0003 Å |
b | 9.3025 ± 0.0004 Å |
c | 14.7753 ± 0.0006 Å |
α | 90° |
β | 94.526 ± 0.002° |
γ | 90° |
Cell volume | 978.68 ± 0.07 Å3 |
Cell temperature | 100 ± 2 K |
Ambient diffraction temperature | 100 ± 2 K |
Number of distinct elements | 5 |
Space group number | 14 |
Hermann-Mauguin space group symbol | P 1 21/c 1 |
Hall space group symbol | -P 2ybc |
Residual factor for all reflections | 0.0557 |
Residual factor for significantly intense reflections | 0.0348 |
Weighted residual factors for significantly intense reflections | 0.0939 |
Weighted residual factors for all reflections included in the refinement | 0.1011 |
Goodness-of-fit parameter for all reflections included in the refinement | 1.017 |
Diffraction radiation probe | x-ray |
Diffraction radiation wavelength | 0.71073 Å |
Diffraction radiation type | MoKα |